{"text_format":"1","workbook":"xlsx","n_sheets":8,"sheets":["Orçamento Final","Custos Pessoal","Outros Gastos","Orientações de Preenchimento","Km por percurso","Valor Hora","Cálculo PF e PJ","Espaços físicos"],"not_rendered":{"charts":0,"images":1,"macros":1,"external_links":0,"defined_names":7,"comments":4,"pivot_tables":0},"unopened":[],"bounds":{"document_bytes":16777216,"sheet_cells":100000,"rows_first":2000,"rows_last":500,"rows_between":2000,"halvings":0,"cell_chars":16384,"cell_head_chars":4096},"cells_cut":0,"cells_raw":0,"read":"whole","date_system":"1900"}

{"sheet":"Orçamento Final","index":0,"n_rows":108,"n_cols":9,"rows_kept":108,"cut":false,"hidden":false,"merged":[[3,1,3,2],[3,3,3,5],[4,3,4,5],[4,1,4,2],[8,1,9,2],[21,1,21,2],[40,1,41,2],[101,6,101,7],[39,1,39,5],[11,5,13,5],[18,5,21,5],[18,3,21,3],[11,3,13,3],[11,7,13,7],[18,7,21,7],[11,6,13,6],[18,6,21,6],[15,1,15,2],[18,1,18,2],[19,1,19,2],[20,1,20,2],[104,1,104,4],[105,1,105,4],[107,1,107,4],[102,6,102,7],[87,1,87,3],[96,2,96,4],[94,2,94,4],[95,2,95,4],[92,2,92,4],[93,2,93,4]]}
[null,"Campos editáveis"]
[1,"TIPO DE EVENTO......................"]
[]
[null,"NOME DO EVENTO:"]
[null,"UR QUE REALIZARÁ O EVENTO:"]
[]
[0,"TOTAL DE VAGAS"]
[]
[null,"RECEITAS",null,"Qtde.","Valor","Valor"]
[null,null,null,"Inscritos","Inscrição","Total-R$"]
[null,"Com inscrições"]
[null,"Acadêmicos",null,{"$f":"ROUND(G12,0)","v":0},null,{"$f":"((E12+E13+E14)/H12)*D12","v":{"$error":"#DIV/0!"}},{"$f":"D7*65%","v":0},{"$f":"COUNT(E12:E14)","v":0}]
[null,"Acadêmicos Externos"]
[null,"Outros"]
[null,"Egressos"]
[null,"Bolsa egresso",null,{"$f":"ROUND(G16,0)","v":0},{"$f":"E15*75%","v":0},{"$f":"(D16*E16)","v":0},{"$f":"D7*25%","v":0}]
[null,"Professores"]
[null,"Funcionários"]
[null,"Bolsa funcionário",null,{"$f":"ROUND(G19,0)","v":0},{"$f":"(E18*50%)","v":0},{"$f":"((E19+E20+E21+E22)/I21*D19)","v":{"$error":"#DIV/0!"}},{"$f":"D7*10%","v":0},{"$f":"COUNT(E19:E22)","v":4}]
[null,"Bolsa professores",null,null,{"$f":"(E17*50%)","v":0},null,null,null,{"$f":"COUNTIFS(E19:E22,0)","v":4}]
{"$rows_left_out":89}
{"sheet":"Custos Pessoal","index":1,"n_rows":63,"n_cols":21,"rows_kept":63,"cut":false,"hidden":false,"merged":[[4,14,4,15],[5,1,5,3],[4,1,4,3],[39,14,40,14],[33,1,37,1],[17,1,29,1],[47,0,49,0],[47,2,49,2],[47,3,49,3],[47,14,47,16],[47,17,47,19],[47,7,49,8],[47,20,49,20],[48,10,49,10],[48,11,49,11],[48,13,49,13],[48,14,49,14],[48,16,49,16],[48,17,49,17],[48,19,49,19],[47,9,47,13],[48,12,49,12],[50,7,50,8],[51,7,51,8],[52,7,52,8],[13,2,13,8],[47,4,49,4],[47,5,49,5],[47,6,49,6],[30,20,32,20],[31,10,32,10],[31,11,32,11],[31,12,32,12],[30,5,32,5],[30,6,32,6],[30,7,32,7],[30,8,32,8],[31,13,32,13],[31,16,32,16],[31,17,32,17],[31,19,32,19],[30,14,30,16],[30,17,30,19],[30,0,32,0],[30,2,32,2],[30,3,32,3],[30,4,32,4],[30,9,30,13],[38,17,38,19],[38,20,40,20],[39,10,40,10],[39,11,40,11],[39,12,40,12],[39,13,40,13],[39,16,40,16],[39,17,40,17],[39,19,40,19],[13,20,15,20],[14,2,15,2],[14,3,15,3],[14,7,15,7],[14,8,15,8],[14,10,15,10],[14,11,15,11],[14,12,15,12],[14,13,15,13],[14,14,15,14],[14,16,15,16],[14,17,15,17],[14,19,15,19],[13,9,13,13],[13,14,13,16],[13,17,13,19],[53,7,53,8],[54,7,54,8],[55,0,55,1],[61,0,61,1],[31,14,32,14],[38,0,40,0],[38,2,40,2],[38,3,40,3],[38,4,40,4],[41,1,54,1],[38,9,38,13],[38,14,38,16],[38,5,40,5],[38,6,40,6],[38,7,40,7],[38,8,40,8]]}
[]
[null,null,null,"Campos editáveis"]
[]
[]
["HORA/AULA PROFESSORES",2021,null,null,null,null,"Valor por refeição",null,null,null,null,45]
["Plano Antigo-Especialista-A1",{"$f":"IF(A6=\"\",\"\",VLOOKUP(A6,'Valor Hora'!$A$2:$J$41,10,FALSE))","v":42.52},null,null,null,null,"Valor de quilometragem - consultar planilha Km por percurso"]
[null,{"$f":"IF(A7=\"\",\"\",VLOOKUP(A7,'Valor Hora'!$A$2:$J$41,10,FALSE))","v":""}]
[null,{"$f":"IF(A8=\"\",\"\",VLOOKUP(A8,'Valor Hora'!$A$2:$J$41,10,FALSE))","v":""}]
[null,{"$f":"IF(A9=\"\",\"\",VLOOKUP(A9,'Valor Hora'!$A$2:$J$41,10,FALSE))","v":""},null,null,null,null,null,null,"DURAÇÃO DO PROJETO: ",null,"MESES"]
[]
[]
[]
[]
[null,null,"CUSTO COM PESSOAL",null,null,null,null,null,null,"AUXÍLIO TRANSPORTE/PASSAGENS",null,null,null,null,"HOSPEDAGENS",null,null,"DIÁRIAS/ALIMENTAÇÃO",null,null,"Total Geral-R$"]
["NOME / FUNÇÃO",null,"    ","Qtde   C/H","Vlr. h/a","Salário","Total","Pagamento Bruto","Valor descontado no projeto","Nº de","Tipo","Trecho ","Preço unitário","Total-R$","Qtde.","Preço","Total-R$","Qtde.","Preço","Total-R$"]
[null,null,null,null,"R$","Base Mês","Meses",null,null,"Viagens",null,null,null,null,null,"Unitário-R$",null,null,"Unitário-R$"]
["PROFESSORES (UNIVALI)",null,null,null,null,null,null,{"$f":"IF(OR(ISBLANK(J17),ISTEXT(J17)),\"\",J17*#REF!)","v":""}]
[null,1,null,null,null,{"$f":"D18*E18","v":0},null,{"$f":"F18*G18","v":0},{"$f":"'Cálculo PF e PJ'!I3","v":0},null,null,null,null,{"$f":"J18*M18","v":0},null,null,{"$f":"O18*P18","v":0},null,null,{"$f":"R18*S18","v":0},{"$f":"H18+N18+Q18+T18","v":0}]
[null,null,null,null,null,{"$f":"D19*E19","v":0},null,{"$f":"F19*G19","v":0},{"$f":"'Cálculo PF e PJ'!I4","v":0},null,null,null,null,{"$f":"J19*M19","v":0},null,null,0,null,null,0,0]
[null,null,null,null,null,0,null,0,{"$f":"'Cálculo PF e PJ'!I5","v":0},null,null,null,null,0,null,null,0,null,null,0,0]
{"$rows_left_out":44}
{"sheet":"Outros Gastos","index":2,"n_rows":124,"n_cols":5,"rows_kept":124,"cut":false,"hidden":false,"merged":[[3,1,3,4],[39,1,39,3],[10,1,10,3]]}
[]
[null,"Campos editáveis"]
[]
[null,"CERTIFICADOS E MATERIAIS DE CONSUMO"]
[]
[null,"MATERIAL DE CONSUMO (Apoio Institucional):","Quantidade","Valor Unitário","Total"]
[null,"Certificados impressos",null,5,{"$f":"C7*D7","v":0}]
[null,"Certificados online",null,3,0]
[null,"Sistema Elis (inscrições on-line - CURSOS)",null,{"$f":"IF('Orçamento Final'!$D$23<=0,0,IF(AND('Orçamento Final'!$D$23>=1,'Orçamento Final'!$D$23<=100),500,IF('Orçamento Final'!$D$23<=500,1000,IF('Orçamento Final'!$D$23<=1000,1500,IF('Orçamento Final'!$D$23>1000,2000,0)))))","v":0},{"$f":"D9","v":0}]
[null,"Sistema Elis (inscrições on-line - EVENTOS)",null,{"$f":"IF('Orçamento Final'!$D$49<=0,0,IF(AND('Orçamento Final'!$D$49>=1,'Orçamento Final'!$D$49<=100),500,IF('Orçamento Final'!$D$49<=500,1000,IF('Orçamento Final'!$D$49<=1000,1500,IF('Orçamento Final'!$D$49>1000,2000,0)))))","v":0},{"$f":"D10","v":0}]
[null,"TOTAL APOIO INSTITUCIONAL",null,null,{"$f":"SUM(E7:E10)","v":0}]
[]
[]
[null,"Material de Consumo","Quantidade","Valor Unitário","Total"]
[null,null,null,null,{"$f":"C15*D15","v":0}]
[null,null,null,null,0]
[null,null,null,null,0]
[null,null,null,null,0]
[null,null,null,null,0]
[null,null,null,null,0]
{"$rows_left_out":105}
{"sheet":"Orientações de Preenchimento","index":3,"n_rows":21,"n_cols":5,"rows_kept":21,"cut":false,"hidden":false,"merged":[]}
["ABA – ORÇAMENTO FINAL",null,"ABA – CUSTOS PESSOAL",null,"ABA – OUTROS GASTOS"]
["Tipo de Evento: Selecionar uma das opções (Curso ou Evento)",null,"Nesta aba devem ser informadas todas as despesas relacionadas aos pagamentos de honorários, deslocamentos, passagem aérea, hospedagens e diárias de alimentação.",null,"Itens à serem preenchidos:"]
["Nome o Evento:",null,"Itens à serem preenchidos: ",null,"No item MATERIAL DE CONSUMO (APOIO INSTITUCIONAL) em Certificados On-Line: informar a quantidade de certificados à serem emitidos, normalmente é equivalente a quantidade de inscritos + o número de pessoas envolvidas nas comissões. O valor calculado nesse campo, será direcionado automaticamente para a aba Orçamento Final, no item Contrapartida Apoio Evento."]
["UR que realizará o evento:",null,"Duração do Projeto: Informar a quantidade total de meses referente a duração do projeto",null,"Obs.: esse valor não contabiliza no total de despesas do projeto, pois é custeado pela Coordenação de Eventos."]
[]
["Total de vagas: informar a quantidade de vagas para viabilidade do curso/evento",null,"No item CUSTO PESSOA, inserir as seguintes informações:",null,"No item MATERIAL DE CONSUMO, informar as necessidades de compras ou solicitações de suprimentos para o evento/curso, com por exemplo:"]
["No item Receitas: preencher os campos editáveis (em azul)",null,"Nome/Função: Inserir o nome do professor/funcionário e/ou Externos PF/PJ (Pessoa Física | Pessoa Jurídica)",null,"Material Gráfico, brindes, decoração, material de expediente, contratação de transportes (para visitas técnicas), etc, todo e qualquer material de apoio de acordo com as necessidades para realização da proposta do projeto."]
["Caso haja alguma receita de apoio, preencher uma das opções: verbas, doações ou UR de Contrapartida. No caso da opção UR de Contrapartida é necessário informar de qual UR sairá o recurso.",null,"Quantidade C/H: Informar a quantidade de horas relacionadas à atividade dentro do projeto",null,"É importante que todos os itens necessários para realização do evento/curso estejam elencados nesse item, pois somente os itens previstos na planilha poderão ser comprados de acordo com a receita do evento/curso."]
["Os demais Itens dessa planilha não devem ser preenchidos.",null,"Valor h/a R$: Inserir o valor da hora/aula do de acordo com o enquadramento (isso para professores com vínculo e funcionários)",null,"Em relação ao valor unitário dos itens descritos, sugerimos que seja consultado o setor de compras, para verificar se eles possuem essa informação ou ainda, uma consulta prévia na internet, essa última opção é a mais adotada pelos responsáveis dos projetos."]
[null,null,"Total de meses: Informar o total de meses que receberá esses pagamentos",null,"Ao preencher todas essas informações, é importante retornar à aba – Orçamento Final e consulta a linha da planilha referente ao Déficit ou Superávit do projeto. O projeto sempre deverá apresentar um saldo positivo (Superávit). Caso apresente um saldo negativo (Déficit), a sugestão é ajustar os valores das inscrições ou rever as despesas elencadas."]
[]
[null,null,"No item AUXÍLIO TRANSPORTE/PASSAGEM, inserir as seguintes informações:"]
[null,null,"Nº de Viagens: Informar a quantidade de deslocamentos                                                                                                                                            Tipo: informar a modalidade – aéreo, rodoviário, carro                                                                                                                                                 Preço unitário: para a modalidade aéreo e rodoviária fazer uma pesquisa de preço nas agências de competência e para os deslocamentos na modalidade “carro” considerar a Determinação vigente na Universidade."]
[]
[null,null,"No item HOSPEDAGEM, inserir as seguintes informações:"]
[null,null,"Quantidade: informar a quantidade de diárias"]
[null,null,"Preço Unitário:  consultar com o setor de compras, os hotéis conveniados e os preços vigentes"]
[]
[null,null,"No item DIÁRIAS/ALIMENTAÇÃO, inserir as seguintes informações:"]
[null,null,"Quantidade: informar a quantidade de diárias de alimentação"]
{"$rows_left_out":2}
{"sheet":"Km por percurso","index":4,"n_rows":143,"n_cols":5,"rows_kept":143,"cut":false,"hidden":true,"merged":[[1,0,1,1],[1,2,2,2],[1,3,2,3],[1,4,2,4]]}
["VALOR LITRO",3.2]
["LOCALIDADES",null,"KM","KM PAGA","VALORES PAGOS"]
["PROCEDÊNCIA","DESTINO"]
["Angelina","Santo Amaro",80,{"$f":"C4*0.11","v":8.8000000000000007},{"$f":"D4*$B$1","v":28.160000000000004}]
["Angelina","Taquaras",290,31.9,102.08]
["Balneário Camboriú","Porto Belo",60,6.6,21.12]
["Balneário Camboriú","Nova Trento",63,6.93,22.176000000000002]
["Balneário Camboriú","Piçarras",77,8.4700000000000006,27.104000000000003]
["Balneário Camboriú","Brusque",102,11.22,35.904000000000003]
["Balneário Camboriú","Bombinhas",110,12.1,38.72]
["Balneário Camboriú","Gaspar",122,13.42,42.944000000000003]
["Balneário Camboriú","Biguaçu",125,13.75,44]
["Balneário Camboriú","Blumenau",144,15.84,50.688000000000002]
["Balneário Camboriú","São José",156,17.16,54.912000000000006]
["Balneário Camboriú","Florianópolis",166,18.260000000000002,58.432000000000009]
["Balneário Camboriú","Rio dos Cedros",198,21.78,69.696000000000012]
["Balneário Camboriú","São Francisco",214,23.54,75.328000000000003]
["Balneário Camboriú","Joinville",229,25.19,80.608000000000004]
["Balneário Camboriú","Santo Amaro",230,25.3,80.960000000000008]
["Balneário Camboriú","Jaraguá do Sul",276,30.36,97.152000000000001]
{"$rows_left_out":124}
{"sheet":"Valor Hora","index":5,"n_rows":41,"n_cols":10,"rows_kept":41,"cut":false,"hidden":true,"merged":[]}
["TABELA DE VALORES HORA / AULA",2013,2014,2015,2016,2016,2017,2018,2019,2021]
["Plano Antigo-Especialista-A1",28.226653499999998,{"$f":"(B2*6%)+B2","v":29.920252709999996},{"$f":"(C2*7.68%)+C2","v":32.218128118127993},{"$f":"(D2*5.86%)+D2","v":34.106110425850297},{"$f":"(E2*5.37%)+E2","v":35.937608555718455},{"$f":"(F2*5.21%)+F2","v":37.809957961471383},{"$f":"G2*1.0184","v":38.505661187962453},{"$f":"H2*1.0417","v":40.111347259500491},42.52]
["Plano Antigo-Especialista-A2",28.7736375,{"$f":"(B3*6%)+B3","v":30.500055749999998},{"$f":"(C3*7.68%)+C3","v":32.842460031599998},{"$f":"(D3*5.86%)+D3","v":34.767028189451757},{"$f":"(E3*5.37%)+E3","v":36.634017603225317},{"$f":"(F3*5.21%)+F3","v":38.542649920353355},{"$f":"G3*1.0184","v":39.251834678887853},{"$f":"H3*1.0417","v":40.88863618499748},43.33]
["Plano Antigo-Especialista-A3",29.468762999999999,31.236888779999997,33.635881838303995,35.606944514028612,37.519037434431951,39.473779284765854,{"$f":"G4*1.0184","v":40.200096823605541},41.876440861149895,44.37]
["Plano Antigo-Especialista-A4",30.015747000000001,31.816691820000003,34.260213751776,36.267862277630073,38.215446481938805,40.206471243647819,40.946270314530935,42.653729786646878,45.21]
["Plano Antigo-Especialista-A5",30.59,32.425399999999996,34.915670719999994,36.961729024191996,38.946573872791106,40.975690371563523,41.729643074400293,43.46976919060279,46.06]
["Plano Antigo-Mestre-B1",33.719284500000001,35.742441569999997,38.487461082575997,40.742826302014947,42.93071607443315,45.167406381911114,45.998486659338276,47.916623553032686,50.78]
["Plano Antigo-Mestre-B2",34.528365000000001,36.600066900000002,39.410952037919998,41.720433827342113,43.960821123870382,46.251179904424028,47.102201614665425,49.066363421996975,52.01]
["Plano Antigo-Mestre-B3",35.4286095,37.554326070000002,40.438498312176002,42.808194313269517,45.106994347892091,47.457068753417268,48.330278818480146,50.34565144521077,53.35]
["Plano Antigo-Mestre-B4",36.317458500000001,38.496506009999997,41.453037671567998,43.882185679121882,46.238659050090725,48.647693186600449,49.542810741233893,51.608745949143348,54.69]
["Plano Antigo-Mestre-B5",37.183516500000003,39.414527490000005,42.441563201232007,44.928638804824203,47.341306708643259,49.80778878816357,50.72425210186578,52.839453414513585,56]
["Plano Antigo-Doutor-C1",40.932636000000002,43.388594160000004,46.720838191488006,49.458679309509208,52.114610388429853,54.82978158966705,55.838649570916921,58.16712125802416,61.66]
["Plano Antigo-Doutor-C2",42.106372500000006,44.632754850000005,48.060550422480006,50.876898677237335,53.608988136204978,56.402016418101255,57.439813520194313,59.835053743986421,63.39]
["Plano Antigo-Doutor-C3",43.416855000000005,46.021866300000006,49.556345631840003,52.460347485865825,55.277468145856822,58.157424236255963,59.22752084220307,61.69730846132294,65.38]
["Plano Antigo-Doutor-C4",44.704546499999992,47.386819289999991,51.026127011471992,54.016258054344249,56.916931111862532,59.882303222790568,60.984137602089916,63.527176140097069,67.3]
["Plano Antigo-Especial-1",49.182977999999999,52.133956679999997,56.137844553023996,59.427522243831206,62.618780188324941,65.881218636136666,67.093433059041573,69.891229217603609,74.06]
["Plano Antigo-Especial-2",54.060251999999998,57.30386712,61.704804114816,65.320705635944222,68.828427528594432,72.414388602834208,73.746813353126356,76.822055469951735,81.430000000000007]
["Novo Plano-Prof.Colaborador-1",26.836402499999998,28.446586649999997,30.631284504719996,32.426277776696587,34.167568893305194,35.947699232646393,36.609136898527083,38.135737907195669,40.44]
["Novo Plano-Prof.Colaborador-2",30.665290500000001,32.505207930000005,35.001607899024002,37.052702121906812,39.042432225853204,41.076542944820154,41.832351335004844,43.576760385674547,46.17]
["Novo Plano-Prof.Colaborador-3",35.793265500000004,37.940861430000005,40.854719587824007,43.248806155670493,45.571267046229998,47.94553005933858,48.82772781243041,50.863844062208763,53.9]
{"$rows_left_out":22}
{"sheet":"Cálculo PF e PJ","index":6,"n_rows":30,"n_cols":13,"rows_kept":30,"cut":false,"hidden":true,"merged":[]}
["Pessoa Física","PF",null,null,null,null,"Docentes internos",null,null,null,"Coordenadores"]
["Nome","Valor Líquido"," 25% (INSS+ISS)","Valor bruto",null,null,"Nome ","Valor líquido","Valor Bruto",null,"Nome ","Valor líquido","Valor Bruto"]
[{"$f":"'Custos Pessoal'!#REF!","v":{"$error":"#REF!"}},{"$f":"'Custos Pessoal'!H42","v":0},{"$f":"D3-B3","v":0},{"$f":"B3/75%","v":0},null,null,{"$f":"'Custos Pessoal'!A18","v":0},{"$f":"'Custos Pessoal'!H18","v":0},{"$f":"H3*1.40944444","v":0},null,{"$f":"'Custos Pessoal'!A60","v":0},{"$f":"'Custos Pessoal'!H60","v":0},{"$f":"L3*1.40944444","v":0}]
[{"$f":"'Custos Pessoal'!#REF!","v":{"$error":"#REF!"}},{"$f":"'Custos Pessoal'!H43","v":0},{"$f":"D4-B4","v":0},{"$f":"B4/75%","v":0},null,null,{"$f":"'Custos Pessoal'!A19","v":0},{"$f":"'Custos Pessoal'!H19","v":0},{"$f":"H4*1.40944444","v":0},null,{"$f":"'Custos Pessoal'!A61","v":0},{"$f":"'Custos Pessoal'!H61","v":0},{"$f":"L4*1.40944444","v":0}]
[{"$f":"'Custos Pessoal'!#REF!","v":{"$error":"#REF!"}},{"$f":"'Custos Pessoal'!H44","v":0},{"$f":"D5-B5","v":0},{"$f":"B5/75%","v":0},null,null,{"$f":"'Custos Pessoal'!A20","v":0},{"$f":"'Custos Pessoal'!H20","v":0},0,null,null,{"$f":"SUM(L3:L4)","v":0},{"$f":"SUM(M3:M4)","v":0}]
[{"$f":"'Custos Pessoal'!#REF!","v":{"$error":"#REF!"}},{"$f":"'Custos Pessoal'!H45","v":0},{"$f":"D6-B6","v":0},{"$f":"B6/75%","v":0},null,null,{"$f":"'Custos Pessoal'!A21","v":0},{"$f":"'Custos Pessoal'!H21","v":0},0]
[null,{"$f":"'Custos Pessoal'!H46","v":0},{"$f":"D7-B7","v":0},{"$f":"B7/75%","v":0},null,null,{"$f":"'Custos Pessoal'!A22","v":0},{"$f":"'Custos Pessoal'!H22","v":0},0]
[null,{"$f":"'Custos Pessoal'!H47","v":0},0,0,null,null,{"$f":"'Custos Pessoal'!A23","v":0},{"$f":"'Custos Pessoal'!H23","v":0},0]
[null,{"$f":"SUM(B3:B8)","v":0},{"$f":"SUM(C3:C8)","v":0},{"$f":"SUM(D3:D8)","v":0},null,null,{"$f":"'Custos Pessoal'!A24","v":0},{"$f":"'Custos Pessoal'!H24","v":0},0]
[null,null,null,null,null,null,{"$f":"'Custos Pessoal'!A25","v":0},{"$f":"'Custos Pessoal'!H25","v":0},0]
[null,null,null,null,null,null,{"$f":"'Custos Pessoal'!A26","v":0},{"$f":"'Custos Pessoal'!H26","v":0},0]
[null,null,null,null,null,null,{"$f":"'Custos Pessoal'!A27","v":0},{"$f":"'Custos Pessoal'!H27","v":0},0]
[null,null,null,null,null,null,{"$f":"'Custos Pessoal'!A28","v":0},{"$f":"'Custos Pessoal'!H28","v":0},0]
[null,null,null,null,null,null,{"$f":"'Custos Pessoal'!A29","v":0},{"$f":"'Custos Pessoal'!H29","v":0},0]
[null,null,null,null,null,null,{"$f":"'Custos Pessoal'!A30","v":0},{"$f":"'Custos Pessoal'!H30","v":0},0]
[]
[]
[]
[]
[null,null,null,null,null,null,null,{"$f":"SUM(H3:H15)","v":0},{"$f":"SUM(I3:I15)","v":0}]
{"$rows_left_out":11}
{"sheet":"Espaços físicos","index":7,"n_rows":27,"n_cols":7,"rows_kept":27,"cut":false,"hidden":true,"merged":[]}
["Cód.","Espaço","Campus","Localização","Capacidade - lugares","R$/Hora"]
[101,"Auditório ","B. Camboriú","Bl. 4",200,33]
[102,"Auditório ","Biguaçu","Bl. 2",314,33,27]
[103,"Auditório ","São José",null,376,26]
[104,"Auditório ","Kobrasol",null,288,77,83]
[105,"Auditório ","Tijucas",null,150,28]
[106,"Auditório - Direito","Itajaí","D1",350,27]
[107,"Auditório III - Enfermagem/Psicologia","Itajaí","F4",133,16]
[108,"Auditório IV - Farmácia","Itajaí","E1",220,22]
[109,"Auditório I - Medicina","Itajaí","F4",214,22]
[110,"Auditório II - Medicina","Itajaí","F4",124,16]
[111,"Auditório ","Piçarras",null,150,22]
[112,"Auditório II","B. Camboriú","Bl. 7",516,100,109]
[113,"Auditório - Centro de Vivência","Itajaí",null,60,14]
[114,"Estúdio de áudio - Valor hora",null,null,null,98,97]
[115,"Entrega de panfletos",null,null,null,648,8]
[116,"Foyer","B. Camboriú","Bl. 7",null,810,57]
[117,"Laboratório de informática",null,null,null,121.5,39]
[118,"Laboratório TOCE (meio período)","Itajaí","F6",null,33]
[119,"Laboratório Cozinha Pedagógica","B. Camboriú",null,null,51]
{"$rows_left_out":7}